{"text_format":"1","workbook":"xlsx","n_sheets":6,"sheets":["Home","Energy","Chiller","Pump","Financials","InfoText"],"not_rendered":{"charts":10,"images":11,"macros":1,"external_links":0,"defined_names":3,"comments":0,"pivot_tables":0},"unopened":[],"bounds":{"document_bytes":16777216,"sheet_cells":100000,"rows_first":2000,"rows_last":500,"rows_between":2000,"halvings":0,"cell_chars":16384,"cell_head_chars":4096},"cells_cut":0,"cells_raw":0,"read":"whole","date_system":"1900"}

{"sheet":"Home","index":0,"n_rows":60,"n_cols":14,"rows_kept":60,"cut":false,"hidden":false,"merged":[[24,11,24,12],[24,9,24,10],[24,3,24,4],[22,1,22,9],[45,1,45,5],[24,5,24,6],[29,7,29,8],[28,7,28,8],[27,7,27,8],[26,7,26,8],[25,7,25,8],[24,7,24,8],[26,1,26,2],[27,11,27,12],[32,11,32,12],[31,11,31,12],[30,5,30,6],[30,3,30,4],[28,3,28,4],[27,3,27,4],[30,1,30,2],[29,1,29,2],[28,1,28,2],[27,1,27,2],[16,1,16,9],[17,1,17,9],[50,1,50,9],[51,1,51,9],[52,1,52,9],[49,1,49,9],[41,1,41,9],[42,1,42,9],[43,1,43,9],[25,1,25,2],[24,1,24,2],[30,7,30,8],[46,1,46,5],[47,1,47,5],[27,5,27,6],[28,5,28,6],[31,7,31,8],[32,7,32,8],[31,9,31,10],[32,9,32,10],[55,1,58,13],[31,1,32,6],[34,1,34,9],[35,1,35,9],[36,1,36,9],[37,1,37,9],[30,11,30,12],[30,9,30,10],[29,11,29,12],[28,11,28,12],[29,9,29,10],[28,9,28,10],[27,9,27,10],[26,11,26,12],[26,5,26,6],[29,3,29,4],[25,11,25,12],[26,3,26,4],[25,3,25,4],[25,9,25,10],[26,9,26,10],[25,5,25,6],[29,5,29,6],[14,1,14,9],[15,1,15,9],[10,1,10,9],[6,1,6,3],[7,1,7,3],[8,1,8,3],[9,1,9,13],[6,5,6,13],[7,5,7,13],[11,1,11,9],[12,1,12,9],[13,1,13,9]]}
[]
[]
[]
[]
[]
[]
[null,"Project",null,null,null,"Enter Project Name"]
[null,"Information"]
[null,"Climate Region",null,null,null,"North East",null,"Chiller Cooling",null,"Water Cooled",null,"Plant Design",null,"Primary/Secondary"]
[]
[null,null,null,null,null,null,null,null,null,null,null,"Value",null,"Unit"]
[null,"Electricity Cost (Average)",null,null,null,null,null,null,null,null,null,0.1701,null,"$/kWh"]
[null,"Chilled Water Plant Load (Design Cooling Load)",null,null,null,null,null,null,null,null,null,1791,null,"tons"]
[null,"Number Of Chillers",null,null,null,null,null,null,null,null,null,2,null,"pcs."]
[null,"Operating Hours / Day",null,null,null,null,null,null,null,null,null,12,null,"hours"]
[null,"Operating Days / Week",null,null,null,null,null,null,null,null,null,5,null,"days"]
[null,"Chiller Design Integrated Part Load Value (IPLV)",null,null,null,null,null,null,null,null,null,0.6,null,"kW/ton"]
[null,{"$f":"IF($N$9=Chiller!$L$11,\"Actual Secondary Pump Head (Design)\",\"Actual Primary Pump Head (Design)\")","v":"Actual Secondary Pump Head (Design)"},null,null,null,null,null,null,null,null,null,135,null,"ft."]
[null,"Minimum Distribution Pump Flow Percentage",null,null,null,null,null,null,null,null,null,30,null,"%"]
[null,"Pump, VFD, Motor Efficiency (Average)",null,null,null,null,null,null,null,null,null,65,null,"%"]
{"$rows_left_out":41}
{"sheet":"Energy","index":1,"n_rows":35,"n_cols":7,"rows_kept":35,"cut":false,"hidden":false,"merged":[[21,1,21,3],[19,4,20,4],[19,5,20,5],[19,6,20,6],[34,1,34,5],[16,1,16,3],[32,1,32,3],[30,1,30,3],[29,1,29,3],[28,1,28,3],[27,1,27,3],[26,1,26,3],[20,1,20,3],[25,1,25,3],[24,1,24,3],[23,1,23,3],[22,1,22,3]]}
[]
[]
[]
[]
[null,"Operating Hours / Day",null,{"$f":"Home!L15","v":12},"hours",null,"Editable Field"]
[null,"Operating Days / Week",null,{"$f":"Home!L16","v":5},"days",null,"Label"]
[null,"Operating Weeks/Year",null,52,"weeks"]
[null,"Annual Operating Hours",null,{"$f":"(D5*D6)*D7*G35","v":2748.2988204456096},"hours","(adjusted for climate region)"]
[]
[null,"Point","Bin","Load","% of Operating Time","Operating Hours","Tons"]
[null,"A","Design",1,0.05,{"$f":"$D$8*E11","v":137.41494102228049},{"$f":"D11*Home!$L$13","v":1791}]
[null,"B","Peak",0.8,0.4,{"$f":"$D$8*E12","v":1099.3195281782439},{"$f":"D12*Home!$L$13","v":1432.8000000000002}]
[null,"C","Mid",0.6,0.3,{"$f":"$D$8*E13","v":824.48964613368287},{"$f":"D13*Home!$L$13","v":1074.5999999999999}]
[null,"D","Partial",0.4,0.15,{"$f":"$D$8*E14","v":412.24482306684143},{"$f":"D14*Home!$L$13","v":716.40000000000009}]
[null,"E","Low",0.2,0.1,274.82988204456097,{"$f":"D15*Home!$L$13","v":358.20000000000005}]
[null,"F","Min",0.1,{"$f":"1-SUM(E11:E15)","v":0},{"$f":"$D$8*E16","v":0},{"$f":"D16*Home!$L$13","v":179.10000000000002}]
[null,null,null,null,null,{"$f":"SUM(F11:F16)","v":2748.2988204456101}]
[]
[]
[null,null,null,null,"Cooling Degree Days","Humidity Adjustment","Multiplier"]
{"$rows_left_out":16}
{"sheet":"Chiller","index":2,"n_rows":69,"n_cols":17,"rows_kept":69,"cut":false,"hidden":false,"merged":[[11,1,11,4]]}
[null,null,null,null,null,null,null,null,null,null,null,"Editable Field"]
[null,null,null,null,null,null,null,null,null,null,null,"Label"]
[]
[]
[null,"Aggregation of Energy Consumption",null,null,null,"[kW/ton]","Flow [GPM]","Head [Ft]","Power [kW]","Ratio"]
[null,"KW1 Compressor",null,null,null,{"$f":"Home!L17","v":0.6},null,null,{"$f":"Home!$L$13*F6","v":1074.5999999999999},{"$f":"I6/$I$12","v":0.8498321017968492}]
[null,{"$f":"IF(Home!N9=$L$11,\"KW2 Constant Speed Primary Pumps (each)\",\"\")","v":"KW2 Constant Speed Primary Pumps (each)"},null,null,null,null,{"$f":"IF(Home!$N$9=$L$11,Home!L13*12000/(Home!L14*500*Home!L21),0)","v":1535.1428571428571},26,{"$f":"0.746 * G7*H7/(3960*Home!$L$20/100)","v":11.567844155844156},{"$f":"I7/$I$12","v":9.1482647610454486E-3}]
[null,{"$f":"IF(Home!J9=$M$11,\"KW3 Condenser Pumps (each)\",\"\")","v":"KW3 Condenser Pumps (each)"},null,null,null,null,{"$f":"IF(Home!J9=M$11,3*Home!L13/Home!L14,\"-\")","v":2686.5},45,{"$f":"IF(Home!J9=$M$11,G8*H8/(3960*Home!$L$20/100)*0.746,0)","v":35.03722027972028},2.7708686535858812E-2]
[null,{"$f":"IF(Home!J9=$M$11,\"KW4 Cooling Tower Fans (all)\",\"\")","v":"KW4 Cooling Tower Fans (all)"},null,null,null,0.08,null,null,{"$f":"IF(Home!$J$9=$M$11,Home!$L$13*F9,0)","v":143.28},0.11331094690624657]
[null,"KW5 Chiller Controls",null,null,null,0,null,null,{"$f":"Home!$L$13*F10","v":0},0,null,"Chiller Plant Piping","Chiller Cooling"]
[null,"KW6 Transmission Oil Pump and Heater",null,null,null,0,null,null,{"$f":"Home!$L$13*F11","v":0},0,null,"Primary/Secondary","Water Cooled"]
[null,"Total Chiller Plant Energy Consumption",null,null,null,{"$f":"+$F$6+$F$10+$F$11+IF(Home!N9=$L$11,$F$7,0)+IF(Home!J9=$M$11,$F$8+$F$9,0)","v":0.67999999999999994},null,null,{"$f":"SUM(I6:I11)","v":1264.4850644355643},{"$f":"F12/$F$12","v":1},null,"Variable Primary","Air Cooled"]
[]
[null,"Chiller Plant Design Primary loop Delta T",null,null,{"$f":"Home!L21","v":14},null,null,null,null,null,null,null,null,"Actual Delta T Energy Usage","Actual %","Future Delta T Energy Usage","Future %"]
[null,"Design Chiller Primary loop GPM=",null,null,{"$f":"G7*Home!L14","v":3070.2857142857142},null,null,null,null,null,null,null,"Chiller",{"$f":"VLOOKUP(Home!$L$22,Home!$B$26:$K$31,7)*$J6","v":29114.536398915356},{"$f":"+N15/$N$23*100","v":95.39092450290768},{"$f":"VLOOKUP(Home!$L$23,Home!$B$26:$K$31,7)*$J6","v":16207.346763856802},{"$f":"+P15/$N$23*100","v":53.101782915599017}]
[null,null,null,null,null,null,null,null,null,null,null,null,{"$f":"CONCATENATE(\"-\",$M$15,\"-\",B6)","v":"-Chiller-KW1 Compressor"},{"$f":"+$N$15*$J6","v":24742.467660731105},81.0662698626506,{"$f":"+$P$15*$J6","v":13773.523564878788},{"$f":"+P16/$P$23*100","v":79.369894836758505}]
[null,"Chiller Energy Usage at Delta T [F]:",null,null,null,{"$f":"+Pump!F19","v":10},null,null,null,null,null,null,{"$f":"IF(Home!$N$9=$L$11,CONCATENATE(\"-\",$M$15,\"-\",B7),\"\")","v":"-Chiller-KW2 Constant Speed Primary Pumps (each)"},{"$f":"+$N$15*IF(Home!$N$9=$L$11,$J7,0)","v":266.34748737237243},0.8726614331534972,{"$f":"+$P$15*IF(Home!$N$9=$L$11,$J7,0)","v":148.26909926983518},0.85440031094115243]
[null,"Load [%]","Time [%]","Time [h/yr]","Flow [GPM]","Tons","Chillers On","Power [kW]",null,null,"LWT Plant",null,{"$f":"IF(Home!$J$9=$M$11,CONCATENATE(\"-\",$M$15,\"-\",B8),\"\")","v":"-Chiller-KW3 Condenser Pumps (each)"},{"$f":"+$N$15*IF(Home!$J$9=$M$11,$J8,0)","v":806.72556271439726},2.6431572254168425,{"$f":"+$P$15*IF(Home!$J$9=$M$11,$J8,0)","v":449.08429105767385},2.5878470956390673]
[null,{"$f":"Energy!$D$11","v":1},{"$f":"+Energy!$E$11*100","v":5},{"$f":"+Energy!$F$17*C19*0.01","v":137.41494102228052},{"$f":"+Pump!E21","v":3070.2857142857142},{"$f":"IF(+E19*$E$14/24>(Home!$L$13), Home!$L$13,(+E19*$E$14/24))","v":1791},{"$f":"ROUNDUP(+IF(E19/(Pump!$E$8/Home!$L$14)>Home!$L$14,Home!$L$14,E19/(Pump!$E$8/Home!$L$14)),0)","v":2},{"$f":"G19*($I$7+$I$8)+($F$9)*F19+($F$10+$F$11)*G19","v":236.49012887112889},"Power Costs",{"$f":"J22*Home!$L$12","v":96052.450205047557},{"$f":"IF(E19>G19*Chiller!$G$7,\"LWT Loss\",\"Normal\")","v":"Normal"},null,{"$f":"IF(Home!$J$9=$M$11,CONCATENATE(\"-\",$M$15,\"-\",B9),\"\")","v":"-Chiller-KW4 Cooling Tower Fans (all)"},{"$f":"+$N$15*IF(Home!$J$9=$M$11,J9,0)","v":3298.995688097481},10.808835981686746,{"$f":"+$P$15*IF(Home!$J$9=$M$11,J9,0)","v":1836.4698086505052},10.582652644901136]
[null,{"$f":"Energy!$D$12","v":0.8},{"$f":"+Energy!$E$12*100","v":40},{"$f":"+Energy!$F$17*C20*0.01","v":1099.3195281782441},{"$f":"+Pump!E22","v":3070.2857142857142},{"$f":"IF(+E20*$E$14/24>(Home!$L$13), Home!$L$13,(+E20*$E$14/24))","v":1791},{"$f":"ROUNDUP(+IF(E20/(Pump!$E$8/Home!$L$14)>Home!$L$14,Home!$L$14,E20/(Pump!$E$8/Home!$L$14)),0)","v":2},{"$f":"G20*($I$7+$I$8)+$F$9*F20+($F$10+$F$11)*G20","v":236.49012887112889},"Avg Tonage",{"$f":"+((F19*D19)+(F20*D20)+(F21*D21)+(F22*D22)+(F23*D23)+(F24*D24))/Energy!$F$17","v":1461.4560000000001},{"$f":"IF(E20>G20*Chiller!$G$7,\"LWT Loss\",\"Normal\")","v":"Normal"},null,{"$f":"CONCATENATE(\"-\",$M$15,\"-\",B10)","v":"-Chiller-KW5 Chiller Controls"},{"$f":"+$N$15*J10","v":0},0,{"$f":"+$P$15*J10","v":0},0]
{"$rows_left_out":50}
{"sheet":"Pump","index":3,"n_rows":72,"n_cols":11,"rows_kept":72,"cut":false,"hidden":false,"merged":[[5,7,5,8]]}
[]
[]
[]
[null,null,null,null,null,null,null,null,null,"Editable Field"]
[null,"Pump Design Factor",null,null,null,1,null,null,null,"Label"]
[null,"Design Chilled Water Distribution dT",null,null,null,{"$f":"+Home!$L$21","v":14}]
[null,"Load [%]","Time [%]","Time [h]","Flow [GPM]","Head [ft]","Power [HP]"]
[null,{"$f":"Energy!$D$11*100","v":100},{"$f":"+Energy!$E$11*100","v":5},{"$f":"+Energy!$F$17*C8*0.01","v":137.41494102228052},{"$f":"+Home!$L$13*24/Home!$L$21","v":3070.2857142857142},{"$f":"+Home!L18","v":135},{"$f":"(E8*F8)/(3960*Home!$L$20/100)","v":161.02897102897103},"Pump costs",{"$f":"I11*Home!$L$12","v":19071.233870300581},null,{"$f":"B8*Home!$L$13*24/$F$6/100","v":3070.2857142857142}]
[null,{"$f":"Energy!$D$12*100","v":80},{"$f":"+Energy!$E$12*100","v":40},{"$f":"+Energy!$F$17*C9*0.01","v":1099.3195281782441},{"$f":"+IF(($E$8*B9/100)<$E$17,$E$17,($E$8*B9/100))","v":2456.2285714285713},{"$f":"IF(($F$8*(E9/$E$8)^2)<$F$15,$F$15,($F$8*(E9/$E$8)^2))","v":86.399999999999991},{"$f":"(E9*F9)/(3960*Home!$L$20/100)","v":82.446833166833159},"Annual Gal.",{"$f":"SUMPRODUCT(E8:E13,D8:D13)*60","v":324021604.10889345},null,{"$f":"B9*Home!$L$13*24/$F$6/100","v":2456.2285714285713}]
[null,{"$f":"Energy!$D$13*100","v":60},{"$f":"+Energy!$E$13*100","v":30},{"$f":"+Energy!$F$17*C10*0.01","v":824.48964613368298},{"$f":"+IF(($E$8*B10/100)<$E$17,$E$17,($E$8*B10/100))","v":1842.1714285714284},{"$f":"IF(($F$8*(E10/$E$8)^2)<$F$15,$F$15,($F$8*(E10/$E$8)^2))","v":48.6},{"$f":"(E10*F10)/(3960*Home!$L$20/100)","v":34.782257742257741},"Avg GPM",{"$f":"+I9/(60*Energy!$F$17)","v":1964.9828571428568},null,{"$f":"B10*Home!$L$13*24/$F$6/100","v":1842.1714285714288}]
[null,{"$f":"Energy!$D$14*100","v":40},{"$f":"+Energy!$E$14*100","v":15},{"$f":"+Energy!$F$17*C11*0.01","v":412.24482306684149},{"$f":"+IF(($E$8*B11/100)<$E$17,$E$17,($E$8*B11/100))","v":1228.1142857142856},{"$f":"IF(($F$8*(E11/$E$8)^2)<$F$15,$F$15,($F$8*(E11/$E$8)^2))","v":30},{"$f":"(E11*F11)/(3960*Home!$L$20/100)","v":14.313686313686315},"Energy [kWh]",{"$f":"SUMPRODUCT(D8:D13,G8:G13)*0.746","v":112117.77701528855},null,{"$f":"B11*Home!$L$13*24/$F$6/100","v":1228.1142857142856}]
[null,{"$f":"Energy!$D$15*100","v":20},{"$f":"+Energy!$E$15*100","v":10},{"$f":"+Energy!$F$17*C12*0.01","v":274.82988204456103},{"$f":"+IF(($E$8*B12/100)<$E$17,$E$17,($E$8*B12/100))","v":921.08571428571418},{"$f":"IF(($F$8*(E12/$E$8)^2)<$F$15,$F$15,($F$8*(E12/$E$8)^2))","v":30},{"$f":"(E12*F12)/(3960*Home!$L$20/100)","v":10.735264735264733},null,null,null,{"$f":"B12*Home!$L$13*24/$F$6/100","v":614.05714285714282}]
[null,{"$f":"Energy!$D$16*100","v":10},{"$f":"+Energy!$E$16*100","v":0},{"$f":"+Energy!$F$17*C13*0.01","v":0},921.08571428571418,30,{"$f":"(E13*F13)/(3960*Home!$L$20/100)","v":10.735264735264733},null,null,null,{"$f":"B13*Home!$L$13*24/$F$6/100","v":307.02857142857141}]
[null," "," "," "]
[null,"Minimum Pump head",null," [ft] and Flow [GPM]",null,30,{"$f":"E8*Home!L19/100","v":921.08571428571418}]
[null,null,null,null,"Min. [GPM]","Head [ft]","Power [HP]","Power [kW]"]
[null,null,null,null,{"$f":"G15","v":921.08571428571418},{"$f":"+F15","v":30},{"$f":"(E17*F17)/(3960*Home!L20/100)","v":10.735264735264733},{"$f":"G17*0.746","v":8.0085074925074906}]
[]
[null,"Chilled Water Distribution Flow at Delta T [F]:",null,null,null,{"$f":"Home!B26","v":10}]
[null,"Load [%]","Time [%]","Time [h]","Flow [GPM]","Head [ft]","Power [HP]",null,"Pump costs"]
{"$rows_left_out":53}
{"sheet":"Financials","index":4,"n_rows":46,"n_cols":22,"rows_kept":46,"cut":false,"hidden":false,"merged":[[46,1,46,11],[37,2,37,11]]}
[]
[]
[]
[]
[]
[]
[]
[]
["Discount Rate:",{"$f":"Home!L43/100","v":0.1}]
["Finance Rate:",0.1]
["Reinvestment Rate:",0.1]
["Inflation Rate",{"$f":"Home!L44/100","v":0.03}]
[]
[" ","Today","End of\nYear 1","End of\nYear 2","End of\nYear 3","End of\nYear 4","End of\nYear 5","End of\nYear 6","End of\nYear 7","End of\nYear 8","End of\nYear 9","End of\nYear 10","End of\nYear 11","End of\nYear 12","End of\nYear 13","End of\nYear 14","End of\nYear 15","End of\nYear 16","End of\nYear 17","End of\nYear 18","End of\nYear 19","End of\nYear 20"]
["Date:",0,1,2,3,4,5,6,7,8,9,10,11,12,13,14,15,16,17,18,19,20]
[]
[]
["Single Investment",{"$f":"Home!L42*-1","v":-290000},0,0,0,0,0,0,0,0,0,0,{"$f":"+L18*(1+$B$12)","v":0},{"$f":"+M18*(1+$B$12)","v":0},0,0,0,0,0,0,0,0]
["Phased Investment",0,0,0,0,0,0,0,0,0,0,0,{"$f":"+L19*(1+$B$12)","v":0},{"$f":"+M19*(1+$B$12)","v":0},0,0,0,0,0,0,0,{"$f":"+U19*(1+$B$12)","v":0}]
["Financed Investment",0,0,0,0,0,0,0,0,0,0,0,{"$f":"+L20*(1+$B$12)","v":0},0,0,0,0,0,0,0,0,0]
{"$rows_left_out":27}
{"sheet":"InfoText","index":5,"n_rows":51,"n_cols":3,"rows_kept":51,"cut":false,"hidden":true,"merged":[]}
["Sheet","Cell Address","Information Displayed"]
["Home","$D$9","NOAA (National Oceanic and Atmospheric Administration) US Standard Regions "]
["Chiller","$C$18","%Time data comes from the Energy tab."]
["Chiller","$F$18","Operating chiller capacity (Tons) calculated from the primary loop.  If the % load cooling tons is greater than the chiller tons, then the Load equals the maximum chiller ton capacity.  Otherwise, this value is eqal to the GPM*dT/24              Operating Chiller Tons=IF(+E19*$E$14/24>(Home!$L$13), Home!$L$13,(+E19*$E$14/24))"]
["Chiller","$E$7","Operating Tons is calculated as secondary loop GPMxchiller plant dT (not to exceed chiller capacity).    Formula=IF(+E19*$E$14/24>(Home!$L$13), Home!$L$13,(+E19*$E$14/24))"]
["Chiller","$H$14","Savings from auxiliary chiller energy consumption in % per degree of delta t improvement"]
["Chiller","$H$18","Chiller plant energy does not include energy saved by chillers because chiller kW/ton does not change for chiller Delta T.    Raising Delta T allows lag chillers to turn off sooner which reduces primary pump power, condenser pump power, cooling tower fan, and auxilliary chiller power.  Power = # chillers running x (KW2(ea) + KW3(ea)) + #tons x (KW4 kw/ton +  KW6 kw/ton)."]
["Chiller","$I$23","Total energy is the Power (Kw, Column H)  times the operation time (h/yr, Column D)."]
["Chiller","$K$18","LWT Plant checks to ensure the secondary loop water flow (GPM) calculated in Pump worksheet is less than or equal to the chiller plant primary loop flow in GPM (applies to Primary/Secondary pumping systems only).   If \"Normal\", then the primary loop GPM is greater than or equal to the secondary loop GPM.  If \"LWT Loss\", then the secondary loop GPM is greater than the primary loop GPM."]
["Chiller","$E$18","Secondary loop water flow (GPM) from the Pump worksheet"]
["Energy","$D$31","http://www7.ncdc.noaa.gov/CDO/CDODivisionalSelect.jsp"]
["Energy","$E$21","5-year average adjusted for population density at base temperature of 65 F\nSource: National Climatic Data Center"]
["Energy","$E$10","If the chiller plant load profile is known from actual trend log data, enter it here.  If a new chiller plant or load profile is not known, then these %Load and %times are building modeling values that are calculated based on building type, location, chiller plant type and number of chillers. These values can be calculated using plant modeling modeling by myPLV(TM) Calculator tool that can be downloaded from the Trane website. The tool uses PNNL (Pacific Northwest National Labs) and ASHRAE / IES 90.1 - 2010 building modeling criteria."]
["Energy","$F$21","adjusted for population density at base temperature of 65 F\n- Use 30% for very humid climate.\n- Use 5% for for very dry climate.\nSource: National Climatic Data Center"]
["Energy","$G$21","Multiplier = (Cooling Degree Days / Average US CDD)*(1 + Humidity Adjustment)"]
["Financials","$B$12","This is the inflation rate that is predicted for the cost of electricity. Some forecasts predict this to between 3 and 4% annually, over the next decade.\n\nFormula  =Home!J38/100"]
["Financials","$B$18","Formula =Home!J36*-1"]
["Financials","$B$9","This depends on the finance instrument of the investment. If the project is financed by a mortgage with an interest rate of 4%, then enter 4. Alternatively, it could be financed by a bank loan or simply by cash that's on an organizations balance sheet. Some companies are using a so called internal Hurdle Rate. \n\nFormula  =Home!J37/100"]
["Financials","$C$26","Formula =Home!J33"]
["Home","$B$25","Average delta T scenarios"]
{"$rows_left_out":31}