{"text_format":"1","workbook":"xlsx","n_sheets":6,"sheets":["Home","Energy","Financials","datasheet","InfoText","Formula Reference"],"not_rendered":{"charts":10,"images":10,"macros":1,"external_links":0,"defined_names":9,"comments":0,"pivot_tables":0},"unopened":[],"bounds":{"document_bytes":16777216,"sheet_cells":100000,"rows_first":2000,"rows_last":500,"rows_between":2000,"halvings":0,"cell_chars":16384,"cell_head_chars":4096},"cells_cut":0,"cells_raw":0,"read":"whole","date_system":"1900"}

{"sheet":"Home","index":0,"n_rows":65,"n_cols":14,"rows_kept":65,"cut":false,"hidden":false,"merged":[[38,3,38,4],[24,1,24,7],[25,1,25,7],[23,1,23,7],[16,1,16,7],[26,1,26,7],[35,1,35,2],[22,1,22,7],[34,7,34,9],[27,9,27,11],[26,9,26,11],[25,9,25,11],[24,9,24,11],[23,9,23,11],[32,9,32,11],[31,9,31,11],[34,11,34,13],[30,9,30,11],[29,9,29,11],[28,9,28,11],[20,1,20,7],[21,1,21,7],[36,11,36,12],[36,13,36,14],[37,11,37,12],[37,13,37,14],[35,9,35,10],[39,9,39,10],[39,7,39,8],[38,9,38,10],[38,7,38,8],[36,9,36,10],[37,9,37,10],[37,7,37,8],[35,7,35,8],[36,7,36,8],[10,5,10,13],[9,5,9,13],[12,5,12,13],[13,5,13,13],[19,9,19,11],[18,9,18,11],[17,9,17,11],[16,9,16,11],[15,9,15,11],[15,1,15,7],[9,1,9,3],[14,1,14,11],[10,1,10,3],[17,1,17,7],[19,1,19,7],[12,1,12,3],[11,1,11,3],[11,5,11,13],[22,9,22,11],[21,9,21,11],[20,9,20,11],[13,1,13,3],[60,1,63,13],[35,11,35,12],[58,1,58,9],[57,1,57,9],[56,1,56,9],[49,1,49,9],[48,1,48,9],[47,1,47,9],[53,1,53,5],[52,1,52,5],[51,1,51,5],[42,1,42,2],[43,1,43,2],[44,1,44,2],[38,11,38,12],[38,13,38,14],[39,11,39,12],[39,13,39,14],[37,5,37,6],[36,3,36,4],[35,3,35,4],[35,5,35,6],[36,5,36,6],[55,1,55,7],[42,7,42,8],[42,9,42,10],[43,7,43,8],[43,9,43,10],[44,7,44,8],[44,9,44,10],[42,3,42,4],[43,3,43,4],[44,3,44,4],[44,5,44,6],[43,5,43,6],[42,5,42,6],[39,5,39,6],[38,5,38,6],[37,1,37,2],[36,1,36,2],[37,3,37,4],[39,1,39,2],[38,1,38,2],[39,3,39,4]]}
[]
[]
[]
[]
[]
[]
[]
[]
[]
[null,"Project",null,null,null,"1224 Hospital Avenue, Danbury, CT"]
[null,"Sample Site",null,null,null,"Version 1.0 / Facility #1 / Suppy Air System"]
[null,"Company Name",null,null,null,"XYZ Mechanical Contractor "]
[null,"Company Address",null,null,null,"33 Turner Road, Danbury, CT 06810"]
[null,"Phone / Email",null,null,null,"203-749-3158, your.name@XYZ.Contracting.com"]
[]
[null,null,null,null,null,null,null,null,null,"Value",null,null,null,"Unit"]
[null,"Belimo Actuator",null,null,null,null,null,null,{"$f":"MATCH(Actuator,datasheet!A:A,0)","v":4},"AFB24-SR"]
[null,"Belimo Actuator Power Consumption (Running)",null,null,null,null,null,null,{"$f":"IFERROR(INDEX(datasheet!B:B,ActuatorRow),\"\")","v":"5.5 W"},{"$f":"IFERROR(LEFT(I18,FIND(\" \",I18)-1)+0,I18)","v":5.5},null,null,null,{"$f":"IFERROR(MID(I18,FIND(\" \",I18)+1,100),I18)","v":"W"}]
[null,"Belimo Actuator Power Consumption (Holding)",null,null,null,null,null,null,{"$f":"IFERROR(INDEX(datasheet!C:C,ActuatorRow),\"\")","v":"3 W"},3,null,null,null,{"$f":"IFERROR(MID(I19,FIND(\" \",I19)+1,100),I19)","v":"W"}]
[null,"Operating Hours / Day",null,null,null,null,null,null,null,18,null,null,null,"hours"]
[null,"Operating Days / Week",null,null,null,null,null,null,null,7,null,null,null,"days"]
[null,"Percentage of Time (Running)",null,null,null,null,null,null,null,30,null,null,null,"%"]
[null,"Percentage of Time (Holding)",null,null,null,null,null,null,null,{"$f":"100-J22","v":70},null,null,null,"%"]
[null,"Number of Actuators on Jobsite",null,null,null,null,null,null,null,110,null,null,null,"#"]
[null,"State",null,null,null,null,null,null,null,"Connecticut"]
[null,"Job Site",null,null,null,null,null,null,null,"Commercial"]
[null,"Electricity Cost (Average)",null,null,null,null,null,null,null,{"$f":"IFERROR(INDEX(Energy!$E$10:$G$61,MATCH(J25,ListStates,0),MATCH(J26,Energy!E8:G8,0)),\"\")","v":14.92},null,null,null,"¢/kWh"]
[null,"Competitor 1 Actuator Power Consumption (Running)",null,null,null,null,null,null,{"$f":"IFERROR(INDEX(datasheet!G:G,ActuatorRow),\"\")","v":"9.6 W"},{"$f":"IFERROR(LEFT(I28,FIND(\" \",I28)-1)+0,I28)","v":9.6},null,null,null,{"$f":"IFERROR(MID(I28,FIND(\" \",I28)+1,100),I28)","v":"W"}]
[null,"Competitor 1 Actuator Power Consumption (Holding)",null,null,null,null,null,null,{"$f":"IFERROR(INDEX(datasheet!H:H,ActuatorRow),\"\")","v":"3 W"},{"$f":"IFERROR(LEFT(I29,FIND(\" \",I29)-1)+0,I29)","v":3},null,null,null,"W"]
[null,"Competitor 2 Actuator Power Consumption (Running)",null,null,null,null,null,null,{"$f":"IFERROR(INDEX(datasheet!L:L,ActuatorRow),\"\")","v":"7 W"},7,null,null,null,"W"]
{"$rows_left_out":36}
{"sheet":"Energy","index":1,"n_rows":62,"n_cols":7,"rows_kept":62,"cut":false,"hidden":false,"merged":[[7,5,8,5],[7,6,8,6],[8,1,8,3],[7,4,8,4],[61,1,61,3],[60,1,60,3]]}
[]
[]
[]
[]
[null,"Operating Hours / Day",null,{"$f":"Home!J20","v":18},"hours",null,"Editable Field"]
[null,"Operating Days / Week",null,{"$f":"Home!J21","v":7},"days",null,"Label"]
[null,"Annual Operating Hours",null,{"$f":"(D5*D6)/7*365","v":6570}]
[null,null,null,null,"Residential","Commercial","Industrial"]
[null,"Census Divisions and States"]
[null,"Alabama",null,null,11.9,10.98,6.82]
[null,"Alaska",null,null,21.27,18.66,15.48]
[null,"Arizona",null,null,12.83,11.48,6.97]
[null,"Arkansas",null,null,10.38,8.6,6.81]
[null,"California",null,null,18,18.309999999999999,13.3]
[null,"Colorado",null,null,12.6,10.26,7.42]
[null,"Connecticut",null,null,20.399999999999999,14.92,12.19]
[null,"Delaware",null,null,13.23,10.07,7.62]
[null,"District of Columbia",null,null,13.47,11.85,8.83]
[null,"Florida",null,null,11.94,9.56,8.58]
[null,"Georgia",null,null,13.28,11.31,7.94]
[null,"Hawaii",null,null,30.04,27.3,23.46]
[null,"Idaho",null,null,10.67,8.08,7.17]
[null,"Illinois",null,null,12.56,9,6.44]
[null,"Indiana",null,null,11.15,9.5,6.72]
[null,"Iowa",null,null,13.57,10.61,7.29]
[null,"Kansas",null,null,12.33,10.220000000000001,7.65]
[null,"Kentucky",null,null,9.9600000000000009,9.14,5.68]
[null,"Lousiana",null,null,9.24,8.34,5.2]
[null,"Maine",null,null,15.42,12.32,7.5]
[null,"Maryland",null,null,13.92,10.92,7.91]
{"$rows_left_out":33}
{"sheet":"Financials","index":2,"n_rows":46,"n_cols":22,"rows_kept":46,"cut":false,"hidden":false,"merged":[[46,1,46,11],[37,2,37,11]]}
[]
[]
[]
[]
[]
[]
[]
[]
["Discount Rate:",{"$f":"Home!L49/100","v":0.1}]
["Finance Rate:",0.1]
["Reinvestment Rate:",0.1]
["Inflation Rate",{"$f":"Home!L50/100","v":0.02}]
[]
[" ","Today","End of\nYear 1","End of\nYear 2","End of\nYear 3","End of\nYear 4","End of\nYear 5","End of\nYear 6","End of\nYear 7","End of\nYear 8","End of\nYear 9","End of\nYear 10","End of\nYear 11","End of\nYear 12","End of\nYear 13","End of\nYear 14","End of\nYear 15","End of\nYear 16","End of\nYear 17","End of\nYear 18","End of\nYear 19","End of\nYear 20"]
["Date:",0,1,2,3,4,5,6,7,8,9,10,11,12,13,14,15,16,17,18,19,20]
[]
[]
["Single Investment",{"$f":"Home!L48*-1","v":-230},0,0,0,0,0,0,0,0,0,0,0,0,0,0,0,0,0,0,0,0]
["Phased Investment",0,0,0,0,0,0,0,0,0,0,0,0,0,0,0,0,0,0,0,0,0]
["Financed Investment",0,0,0,0,0,0,0,0,0,0,0,0,0,0,0,0,0,0,0,0,0]
["Subtotal",{"$f":"SUM(B18:B20)","v":-230},{"$f":"SUM(C18:C20)","v":0},0,0,0,0,{"$f":"SUM(H18:H20)","v":0},{"$f":"SUM(I18:I20)","v":0},{"$f":"SUM(J18:J20)","v":0},{"$f":"SUM(K18:K20)","v":0},{"$f":"SUM(L18:L20)","v":0},{"$f":"SUM(M18:M20)","v":0},0,0,0,0,0,0,0,0,0]
["Rebate/Incentive Rec'd at Date",0]
["Subtotal Outflows",{"$f":"SUM(B21:B22)","v":-230},{"$f":"SUM(C21:C22)","v":0},0,0,0,0,0,0,0,0,0,{"$f":"SUM(M21:M22)","v":0},0,0,0,0,0,0,0,0,0]
[]
[]
["Energy savings",null,{"$f":"Home!H43","v":132.26365152},{"$f":"C26*(1+$B$12)","v":134.9089245504},137.60710304140801,140.35924510223617,143.1664300042809,146.02975860436652,148.95035377645385,151.92936085198292,154.96794806902258,158.06730703040304,{"$f":"L26*(1+$B$12)","v":161.2286531710111},164.45322623443133,167.74229075911995,171.09713657430237,174.51907930578841,178.00946089190418,181.56965010974227,185.20104311193711,188.90506397417585,192.68316525365935]
["Maintenance savings",null,0,{"$f":"C27*(1+$B$12)","v":0},0,0,0,0,0,0,0,0,{"$f":"L27*(1+$B$12)","v":0},0,0,0,0,0,0,0,0,0]
["Rebates/incentives rec'd after Date",null,0,0,0,0,0,0,0,0,0,0,0,0,0,0,0,0,0,0,0,0]
["Subtotal Inflows",null,{"$f":"SUM(C26:C28)","v":132.26365152},{"$f":"SUM(D26:D28)","v":134.9089245504},137.60710304140801,140.35924510223617,143.1664300042809,146.02975860436652,148.95035377645385,151.92936085198292,154.96794806902258,{"$f":"SUM(L26:L28)","v":158.06730703040304},{"$f":"SUM(M26:M28)","v":161.2286531710111},164.45322623443133,167.74229075911995,171.09713657430237,174.51907930578841,178.00946089190418,181.56965010974227,185.20104311193711,188.90506397417585,192.68316525365935]
[]
{"$rows_left_out":17}
{"sheet":"datasheet","index":3,"n_rows":94,"n_cols":19,"rows_kept":94,"cut":false,"hidden":true,"merged":[[0,4,0,8],[0,0,0,3],[0,14,0,18],[0,9,0,13]]}
["BELIMO",null,null,null,"Honeywell",null,null,null,null,"Siemens",null,null,null,null,"Johnson Controls"]
["Actuators","Running","Holding","Torque","Competitor 1","Part Number","Running","Holding","Torque","Competitor 2","Part Number","Running","Holding","Torque","Competitor 3","Part Number","Running","Holding","Torque"]
["AFB24","5 W","2.5 W","180 in-lb","MS8120A…","MS8**","24 W","4.8 W","175 in-lb","GCA121.1U","GCA**","7 W","5 W","160 in-lb","M9220-BGA-3","M92**","14.76 W","4.62 W","177 in-lb"]
["AFB24-SR","5.5 W","3 W","180 in-lb ","MS7120A…","MS7**","9.6 W","3 W","175 in-lb","GCA151.1U","GCA**","7 W","5 W","160 in-lb","M9220-GGA-3","M92**","9.3 W","4.62 W","177 in-lb"]
["AFB24-MFT","7.5 W","3 W","180 in-lb ","MS7520A…","MS7**","9.6 W","3 W","175 in-lb","GCA163.1U","GCA**","7 W","5 W","160 in-lb","M9220-HGA-3","M92**","9.3 W","4.62 W","177 in-lb"]
["AFBUP","7 W","3.5 W","180 in-lb ","MS4120A…","MS4**","36 W","7.8 W","175 in-lb","GCA221.1U","GCA**","8 W","6 W","160 in-lb","M9220-BAA-3","M92**","18 W","9.36 W","177 in-lb"]
["AHB24-3-100","2 W","0.5 W","101 lbf ","--","--","--","--","--","--","--","-- ","-- ","--","--","--","--","--","--"]
["AHB24-3-200","2 W","0.5 W","101 lbf ","--","--","--","--","--","--","--","-- ","-- ","--","--","--","--","--","--"]
["AHKX24-MFT-100","11 W","3 W","101 lbf ","--","--","--","--","--","--","--","-- ","-- ","--","--","--","--","--","--"]
["AHQB24-1-100","13 W","1.5 W","44 lbf ","--","--","--","--","--","--","--","-- ","-- ","--","--","--","--","--","--"]
["AHQB24-MFT-100","13 W","1.5 W","44 lbf ","--","--","--","--","--","--","--","-- ","-- ","--","--","--","--","--","--"]
["AHX120-3-300","2.5 W","0.5 W","101 lbf ","--","--","--","--","--","--","--","-- ","-- ","--","--","--","--","--","--"]
["AHX24-3-300","2 W","0.5 W","101 lbf ","--","--","--","--","--","--","--","-- ","-- ","--","--","--","--","--","--"]
["AHX24-MFT-100","3.5 W","1.3 W","101 lbf ","--","--","--","--","--","--","--","-- ","-- ","--","--","--","--","--","--"]
["AHX24-MFT-200","3.5 W","1.3 W","101 lbf ","--","--","--","--","--","--","--","-- ","-- ","--","--","--","--","--","--"]
["AHX24-MFT-300","3.5 W","1.3 W","101 lbf ","--","--","--","--","--","--","--","-- ","-- ","--","--","--","--","--","--"]
["AMB24-3","2.5 W","0.5 W","180 in-lb ","MN6120A…","MN6**","6 W","2 W","175 in-lb","GBB171.1U","GBB**","7 W","1.1 W","177 in-lb","M9116-AGA-2","M91**","3.48 W","0.54 W","140 in-lb"]
["AMB24-SR","2.5 W","0.4 W","180 in-lb ","MN7220A","MN7**","6 W","2 W","175 in-lb","GBB166.1U","GBB**","8 W","1.1 W","177 in-lb","M9116-GGC-2","M91**","3.84 W","0.9 W","140 in-lb"]
["AMB24-MFT","3.5 W","1.3 W","180 in-lb ","M6184D…","M61**","9 W","2 W","150 in-lb","GBB163.1U","GBB**","8 W","1.1 W","177 in-lb","M9116-GGA-2","M91**","3.84 W","0.9 W","140 in-lb"]
["AMCX24-MFT","4 W","1.25 W","180 in-lb ","M6184D…","M61**","9 W","2 W","--","--","--","-- ","-- ","177 in-lb","--","--","--","--","--"]
["AMQB24-1","15 W","1.5 W","140 in-lb ","--","--","--","--","--","--","--","-- ","-- ","177 in-lb","--","--","--","--","--"]
["AMQB24-MFT","15 W","1.5 W","140 in-lb ","--","--","--","--","--","--","--","-- ","-- ","177 in-lb","--","--","--","--","--"]
["AMX120-3","3 W","0.6 W","180 in-lb ","--","--","--","--","--","--","--","-- ","-- ","--","--","--","--","--","--"]
["CMB120-3","1.5 W","1 W","18 in-lb ","--","--","--","--","--","--","--","-- ","-- ","--","--","--","--","--","--"]
["CMB24-3","1 W","0.2 W","18 in-lb ","--","--","--","--","--","--","--","-- ","-- ","--","M9102-AGA-2","M91**","1.26 W","0 W","18 in-lb"]
["CMB24-SR-R","1.5 W","0.5 W","18 in-lb ","--","--","--","--","--","--","--","-- ","-- ","--","M9102-GGA-2","M91**","2.16 W","0.6 W","18 in-lb"]
["EFB120","9.5 W","4.5 W","270 in-lb ","--","--","--","--","--","--","--","-- ","-- ","--","--","--","--","--","--"]
["EFB24","9.5 W","4.5 W","270 in-lb ","--","--","--","--","--","--","--","-- ","-- ","--","--","--","--","--","--"]
["EFB24-SR","8 W","4.5 W","270 in-lb ","--","--","--","--","--","--","--","-- ","-- ","--","--","--","--","--","--"]
["EFB24-MFT","9.5 W","4.5 W","270 in-lb ","--","--","--","--","--","--","--","-- ","-- ","--","--","--","--","--","--"]
{"$rows_left_out":65}
{"sheet":"InfoText","index":4,"n_rows":22,"n_cols":3,"rows_kept":22,"cut":false,"hidden":true,"merged":[]}
["Sheet","Cell Address","Information Displayed"]
["Home","$H$36","Formula = J18*J22+J19*J23/100*J20*J21*52/1000"]
["Home","$J$36","Formula=H37*J27"]
["Home","$L$36","Formula=H37*J24"]
["Home","$N$36","Formula=J37*J24"]
["Home","$F$42","Formula=L38-L37"]
["Home","$L$42","Formula=N38-N37"]
["Home","$H$25","Visit the Energy Tab to create your own \"Custom Location\" by entering the data found at http://www.eia.gov/electricity"]
["Home","$F$53","The life-cycle savings of an energy improvement divided by the initial investment. (For every dollar invested in an energy improvement, how many dollars will be saved over the life of the improvement in today’s dollars)\n\n=+Financials!G45"]
["Home","$F$54","Net present value is the present value of net cash inflows generated by a project including salvage value, if any, less the initial investment on the project. It is one of the most reliable measures used in capital budgeting because it accounts for time value of money by using discounted cash inflows.\nBefore calculating NPV, a target rate of return is set which is used to discount the net cash inflows from a project. Net cash inflow equals total cash inflow during a period less the expenses directly incurred on generating the cash inflow.\n\nFormula =+Financials!$G$40"]
["Home","$H$27","check:\nhttp://www.eia.gov/electricity"]
["Home","$J$48","Enter the incremental costs for Belimo actuators over competetive actuators. If there are actuators installed in the plant that will be replaced by Belimo Actuators, the whole replacement costs have to be considered."]
["Home","$J$49","This depends on the finance instrument of the investment. If the project is financed by a mortgage with an interest rate of 4%, then enter 4. Alternatively, it could be financed by a bank loan or simply by cash that's on an organizations balance sheet. Some companies are using a so called internal Hurdle Rate. "]
["Home","$J$50","This is the inflation rate that is predicted for the cost of electricity. Some forecasts predict this to between 3 and 4% annually, over the next decade."]
["Home","$J$57","calculation according to EPA www.epa.gov"]
["Home","$J$58","calculation according to EPA www.epa.gov"]
["Home","$J$59","based on annual consumption of 12,258 kWh per home according to EPA www.epa.gov"]
["Energy","$D$61","check:  http://www.eia.gov/electricity"]
["Financials","$B$12","This is the inflation rate that is predicted for the cost of electricity. Some forecasts predict this to between 3 and 4% annually, over the next decade.\n\nFormula =Home!L50/100"]
["Financials","$B$18","Formula =Home!L48*-1"]
["Financials","$B$9","This depends on the finance instrument of the investment. If the project is financed by a mortgage with an interest rate of 4%, then enter 4. Alternatively, it could be financed by a bank loan or simply by cash that's on an organizations balance sheet. Some companies are using a so called internal Hurdle Rate. \n\nFormula  =Home!L49/100"]
["Financials","$C$26","Formula =Home!H43"]

{"sheet":"Formula Reference","index":5,"n_rows":38,"n_cols":11,"rows_kept":38,"cut":false,"hidden":true,"merged":[[1,1,1,9]]}
[]
[null,"COST COMPARISON"]
[]
[null,2," …POWER DRAW (W) RUNNING FSTF120 US"]
[null,1.5," …POWER DRAW (W) HOLDING FSTF120 US"]
[null,18," …POWER DRAW (W) RUNNING MS4104 Series "]
[null,9," … POWER DRAW (W) HOLDING MS4104 Series"]
[null,24," …AVERAGE HRS OF OPERATION PER DAY"]
[null,7," …AVG. DAYS OF OPERATION PER WEEK "]
[null,{"$f":"B9*B8","v":168}," ...HOURS/WK OF OCCUPANCY/OPERATION (HRSOCC)"]
[null,0.995," …PERCENTAGE OF TIME HOLDING"]
[null,5.0000000000000001E-3," …PERCENTAGE OF TIME RUNNING",null,null,null,null,null,"Soure (7/15/14):"]
[null,0.104,"...ELECTRICITY UNIT ($) COST/KWHR (NAT'L AVE. COMMERCIAL)",null,null,null,null,null,"http://www.eia.gov/electricity/monthly/epm_table_grapher.cfm?t=epmt_5_6_a "]
[null,52," ...WEEKS/YEAR OF BUILDING OPERATION (WPY)"]
[]
[null,"FSTF120 US COST OF OPERATION",null,null,null,null,null,"RUNNING","HOLDING"]
[null,"FSTF120 US KW - DEMAND=============================================",null,null,null,null,null,{"$f":"B4/1000","v":2E-3},{"$f":"B5/1000","v":1.5E-3},"KW"]
[null,"KW USED * ELECCOST =============================================",null,null,null,null,null,{"$f":"H17*B13","v":2.0799999999999999E-4},{"$f":"I17*B13","v":1.56E-4},"KW COST"]
[null,"FSTF120 US KWH USAGE - CONSUMPTION=============================================",null,null,null,null,null,{"$f":"((H17)*B10*B14)","v":17.472000000000001},{"$f":"(I17)*B10*B14","v":13.103999999999999},"KWH"]
[null,"KWH USED * ELECCOST =============================================",null,null,null,null,null,{"$f":"H19*B13*B12","v":9.0854400000000002E-3},{"$f":"I19*B13*B11","v":1.3560019199999997},"KWH COST"]
[null,"TOTAL COST ===============================================",null,null,null,null,null,{"$f":"H20+H18","v":9.29344E-3},{"$f":"I20+I218","v":1.3560019199999997},null,{"$f":"SUM(H21:I21)","v":1.3652953599999997}]
[]
[null,"MS4104.. Cost Of Operation"]
[null,"MS4104.. KW - DEMAND=============================================",null,null,null,null,null,{"$f":"B6/1000","v":1.7999999999999999E-2},{"$f":"(B7/1000)","v":8.9999999999999993E-3},"KW"]
[null,"KW USED * ELECCOST =============================================",null,null,null,null,null,{"$f":"H24*B13","v":1.8719999999999997E-3},{"$f":"I24*B13","v":9.3599999999999987E-4},"KW COST"]
[null,"MS4104.. USAGE - CONSUMPTION=============================================",null,null,null,null,null,{"$f":"H24*B10*B14","v":157.24799999999999},{"$f":"(I24)*B10*B14","v":78.623999999999995},"KWH"]
[null,"KWH USED * ELECCOST =============================================",null,null,null,null,null,{"$f":"H26*B13*B12","v":8.1768959999999988E-2},{"$f":"I26*B13*B11","v":8.1360115199999985},"KWH COST"]
[null,"TOTAL COST ===============================================",null,null,null,null,null,{"$f":"H27+H25","v":8.3640959999999986E-2},{"$f":"I27+I25","v":8.1369475199999979},null,{"$f":"SUM(H28:I28)","v":8.2205884799999982}]
[]
[null,"ENERGY SAVINGS PER ACTUATOR"]
{"$rows_left_out":8}